اذهب إلى المحتوى

Mohamed Mehani

الأعضاء
  • المساهمات

    1
  • تاريخ الانضمام

  • تاريخ آخر زيارة

إنجازات Mohamed Mehani

عضو مبتدئ

عضو مبتدئ (1/3)

0

السمعة بالموقع

  1. Dart snapshot generator failed with exit code -1073741819 Font asset "CupertinoIcons.ttf" was tree-shaken, reducing it from 283452 to 2984 bytes (98.9% reduction). Tree-shaking can be disabled by providing the --no-tree-shake-icons flag when building your app. Font asset "fa-solid-900.ttf" was tree-shaken, reducing it from 394668 to 1192 bytes (99.7% reduction). Tree-shaking can be disabled by providing the --no-tree-shake-icons flag when building your app. Font asset "MaterialIcons-Regular.otf" was tree-shaken, reducing it from 1645184 to 7908 bytes (99.5% reduction). Tree-shaking can be disabled by providing the --no-tree-shake-icons flag when building your app. Target android_aot_release_android-arm failed: Exception: AOT snapshotter exited with code -1073741819 FAILURE: Build failed with an exception. * Where: Script 'C:\src\flutter\packages\flutter_tools\gradle\src\main\groovy\flutter.groovy' line: 1297 * What went wrong: Execution failed for task ':app:compileFlutterBuildRelease'. > Process 'command 'C:\src\flutter\bin\flutter.bat'' finished with non-zero exit value 1 * Try: > Run with --stacktrace option to get the stack trace. > Run with --info or --debug option to get more log output. > Run with --scan to get full insights. * Get more help at https://help.gradle.org BUILD FAILED in 1m 28s Running Gradle task 'assembleRelease'... 89.7s Gradle task assembleRelease failed with exit code 1 Process finished with exit code 1
×
×
  • أضف...